Reaction Details
TargetIntegrin-linked protein kinase
LigandBDBM50078259
Substrate/Competitorn/a
Meas. Tech.ChEMBL_1470576 (CHEMBL3419802)
Kd 8700±n/a nM
Citation Yan, RChuang, HCKapuriya, NChou, CCLai, PTChang, HWYang, CNKulp, SKChen, CS Exploitation of the ability of¿-tocopherol to facilitate membrane co-localization of Akt and PHLPP1 to develop PHLPP1-targeted Akt inhibitors. J Med Chem58:2290-8 (2015) 
 
Integrin-linked protein kinase
Name:Integrin-linked protein kinase
Type:Protein
Mol. Mass.:51429.75
Organism:Homo sapiens (Human)
Description:Q13418
Residue:452
BDBM50078259
NameBDBM50078259
Synonyms:CHEMBL3414669
TypeSmall organic molecule
Emp. Form.C18H28O2
Mol. Mass.276.4137
SMILESCC(C)CCC[C@]1(C)CCc2cc(O)c(C)c(C)c2O1