Reaction Details
TargetPolyunsaturated fatty acid 5-lipoxygenase
LigandBDBM50078845
Substrate/Competitorn/a
Meas. Tech.ChEMBL_1472476 (CHEMBL3420629)
IC50 680±n/a nM
Citation Filosa, RPeduto, ASchaible, AMKrauth, VWeinigel, CBarz, DPetronzi, CBruno, FRoviezzo, FSpaziano, GD'Agostino, BDe Rosa, MWerz, O Novel series of benzoquinones with high potency against 5-lipoxygenase in human polymorphonuclear leukocytes. Eur J Med Chem94:132-9 (2015) 
 
Polyunsaturated fatty acid 5-lipoxygenase
Name:Polyunsaturated fatty acid 5-lipoxygenase
Type:Enzyme
Mol. Mass.:77972.74
Organism:Homo sapiens (Human)
Description:Recombinant protein was purified from E. coli lysate. After ammonium sulfate precipitation and subsequent steps, the supernatant (S100) was used for 5-LO activity assay.
Residue:674
BDBM50078845
NameBDBM50078845
Synonyms:5-O-Methylembelin | CHEBI:65842
TypeSmall organic molecule
Emp. Form.C18H28O4
Mol. Mass.308.4125
SMILESCCCCCCCCCCCC1=C(O)C(=O)C=C(OC)C1=O