Reaction Details
TargetMacrophage-expressed gene 1 protein
LigandBDBM50078853
Substrate/Competitorn/a
Meas. Tech.ChEMBL_1472482 (CHEMBL3420871)
IC50>10000±n/a nM
Citation Filosa, RPeduto, ASchaible, AMKrauth, VWeinigel, CBarz, DPetronzi, CBruno, FRoviezzo, FSpaziano, GD'Agostino, BDe Rosa, MWerz, O Novel series of benzoquinones with high potency against 5-lipoxygenase in human polymorphonuclear leukocytes. Eur J Med Chem94:132-9 (2015) 
 
Macrophage-expressed gene 1 protein
Name:Macrophage-expressed gene 1 protein
Type:PROTEIN
Mol. Mass.:78593.74
Organism:Homo sapiens (Human)
Description:ChEMBL_109592
Residue:716
BDBM50078853
NameBDBM50078853
Synonyms:CHEMBL3263323
TypeSmall organic molecule
Emp. Form.C12H16O4
Mol. Mass.224.253
SMILESCCCCCCC1=C(O)C(=O)C=C(O)C1=O