Reaction Details
TargetAmine oxidase [flavin-containing] B
LigandBDBM50282506
Substrate/Competitorn/a
Meas. Tech.ChEMBL_1471139 (CHEMBL3421029)
IC50 0.900000±n/a nM
Citation Xie, SSWang, XJiang, NYu, WWang, KDLan, JSLi, ZRKong, LY Multi-target tacrine-coumarin hybrids: cholinesterase and monoamine oxidase B inhibition properties against Alzheimer's disease. Eur J Med Chem95:153-65 (2015) 
 
Amine oxidase [flavin-containing] B
Name:Amine oxidase [flavin-containing] B
Type:Protein
Mol. Mass.:58768.76
Organism:Homo sapiens (Human)
Description:P27338
Residue:520
BDBM50282506
NameBDBM50282506
Synonyms:7-(5-Isopropyl-[1,3,4]thiadiazol-2-ylmethoxy)-3,4-dimethyl-chromen-2-one CHEMBL19004
TypeSmall organic molecule
Emp. Form.C17H18N2O3S
Mol. Mass.330.401
SMILESCC(C)c1nnc(COc2ccc3c(C)c(C)c(=O)oc3c2)s1