Reaction Details
TargetAmine oxidase [flavin-containing] A
LigandBDBM29136
Substrate/Competitorn/a
Meas. Tech.ChEMBL_1471258 (CHEMBL3418557)
IC50 6480±n/a nM
Citation Xie, SSWang, XJiang, NYu, WWang, KDLan, JSLi, ZRKong, LY Multi-target tacrine-coumarin hybrids: cholinesterase and monoamine oxidase B inhibition properties against Alzheimer's disease. Eur J Med Chem95:153-65 (2015) 
 
Amine oxidase [flavin-containing] A
Name:Amine oxidase [flavin-containing] A
Type:Protein
Mol. Mass.:59689.53
Organism:Homo sapiens (Human)
Description:P21397
Residue:527
BDBM29136
NameBDBM29136
Synonyms:CHEMBL92401 Iprazid | Iproniazid
TypeSmall organic molecule
Emp. Form.C9H13N3O
Mol. Mass.179.219
SMILESCC(C)NNC(=O)c1ccncc1