Reaction Details
TargetGlutamate carboxypeptidase 2
LigandBDBM50102258
Substrate/Competitorn/a
Meas. Tech.ChEMBL_1471477 (CHEMBL3419862)
IC50 47±n/a nM
Citation Roy, JNguyen, TXKanduluru, AKVenkatesh, CLv, WReddy, PVLow, PSCushman, M DUPA conjugation of a cytotoxic indenoisoquinoline topoisomerase I inhibitor for selective prostate cancer cell targeting. J Med Chem58:3094-103 (2015) 
 
Glutamate carboxypeptidase 2
Name:Glutamate carboxypeptidase 2
Type:PROTEIN
Mol. Mass.:84333.66
Organism:Homo sapiens (Human)
Description:ChEMBL_1497035
Residue:750
BDBM50102258
NameBDBM50102258
Synonyms:(S)-2-[3-((S)-3-Carboxy-1-carboxy-propyl)-ureido]-pentanedioic acid CHEMBL46005
TypeSmall organic molecule
Emp. Form.C11H16N2O9
Mol. Mass.320.2527
SMILESOC(=O)CC[C@H](NC(=O)N[C@@H](CCC(O)=O)C(O)=O)C(O)=O