Reaction Details
TargetMelanocyte-stimulating hormone receptor
LigandBDBM50080874
Substrate/Competitorn/a
Meas. Tech.ChEMBL_1475325 (CHEMBL3425222)
IC50 1352±n/a nM
Citation Van der Poorten, OFehér, KBuysse, KFeytens, DZoi, ISchwartz, SDMartins, JCTourwé, DCai, MHruby, VJBallet, S Azepinone-Containing Tetrapeptide Analogues of Melanotropin Lead to Selective hMC4R Agonists and hMC5R Antagonist. ACS Med Chem Lett6:192-7 (2015) 
 
Melanocyte-stimulating hormone receptor
Name:Melanocyte-stimulating hormone receptor
Type:Enzyme
Mol. Mass.:34717.23
Organism:Homo sapiens (Human)
Description:Q01726
Residue:317
BDBM50080874
NameBDBM50080874
Synonyms:CHEMBL3421676
TypeSmall organic molecule
Emp. Form.C40H46N10O5
Mol. Mass.746.8572
SMILESCC(=O)N[C@H]1Cc2c(CN([C@H](Cc3ccccc3)C(=O)N[C@@H](CCCNC(N)=N)C(=O)N[C@@H](Cc3c[nH]c4ccccc34)C(N)=O)C1=O)[nH]c1ccccc21