Reaction Details
TargetMelanocyte-stimulating hormone receptor
LigandBDBM50027084
Substrate/Competitorn/a
Meas. Tech.ChEMBL_1475325 (CHEMBL3425222)
IC50 1.000000±n/a nM
Citation Van der Poorten, OFehér, KBuysse, KFeytens, DZoi, ISchwartz, SDMartins, JCTourwé, DCai, MHruby, VJBallet, S Azepinone-Containing Tetrapeptide Analogues of Melanotropin Lead to Selective hMC4R Agonists and hMC5R Antagonist. ACS Med Chem Lett6:192-7 (2015) 
 
Melanocyte-stimulating hormone receptor
Name:Melanocyte-stimulating hormone receptor
Type:Enzyme
Mol. Mass.:34717.23
Organism:Homo sapiens (Human)
Description:Q01726
Residue:317
BDBM50027084
NameBDBM50027084
Synonyms:Melatonan
TypeSmall organic molecule
Emp. Form.C50H69N15O9
Mol. Mass.1024.178
SMILESCCCC[C@H](NC(C)=O)C(=O)N[C@H]1CC(=O)NCCCC[C@H](NC(=O)[C@H](Cc2c[nH]c3ccccc23)NC(=O)[C@H](CCCNC(N)=N)NC(=O)[C@@H](Cc2ccccc2)NC(=O)[C@H](Cc2cnc[nH]2)NC1=O)C(N)=O