Reaction Details
TargetMelanocortin receptor 4
LigandBDBM50080877
Substrate/Competitorn/a
Meas. Tech.ChEMBL_1475333 (CHEMBL3425230)
IC50 220±n/a nM
Citation Van der Poorten, OFehér, KBuysse, KFeytens, DZoi, ISchwartz, SDMartins, JCTourwé, DCai, MHruby, VJBallet, S Azepinone-Containing Tetrapeptide Analogues of Melanotropin Lead to Selective hMC4R Agonists and hMC5R Antagonist. ACS Med Chem Lett6:192-7 (2015) 
 
Melanocortin receptor 4
Name:Melanocortin receptor 4
Type:Enzyme
Mol. Mass.:36949.50
Organism:Homo sapiens (Human)
Description:P32245
Residue:332
BDBM50080877
NameBDBM50080877
Synonyms:CHEMBL3421679
TypeSmall organic molecule
Emp. Form.C38H45N9O5
Mol. Mass.707.8212
SMILESCC(=O)N[C@H]1Cc2ccccc2CN([C@H](Cc2ccccc2)C(=O)N[C@@H](CCCNC(N)=N)C(=O)N[C@@H](Cc2c[nH]c3ccccc23)C(N)=O)C1=O