Reaction Details
TargetMelanocortin receptor 5
LigandBDBM50080877
Substrate/Competitorn/a
Meas. Tech.ChEMBL_1475397 (CHEMBL3425361)
IC50 37±n/a nM
Citation Van der Poorten, OFehér, KBuysse, KFeytens, DZoi, ISchwartz, SDMartins, JCTourwé, DCai, MHruby, VJBallet, S Azepinone-Containing Tetrapeptide Analogues of Melanotropin Lead to Selective hMC4R Agonists and hMC5R Antagonist. ACS Med Chem Lett6:192-7 (2015) 
 
Melanocortin receptor 5
Name:Melanocortin receptor 5
Type:Enzyme
Mol. Mass.:36612.92
Organism:Homo sapiens (Human)
Description:P33032
Residue:325
BDBM50080877
NameBDBM50080877
Synonyms:CHEMBL3421679
TypeSmall organic molecule
Emp. Form.C38H45N9O5
Mol. Mass.707.8212
SMILESCC(=O)N[C@H]1Cc2ccccc2CN([C@H](Cc2ccccc2)C(=O)N[C@@H](CCCNC(N)=N)C(=O)N[C@@H](Cc2c[nH]c3ccccc23)C(N)=O)C1=O