Reaction Details
TargetDual specificity protein kinase TTK
LigandBDBM50053304
Substrate/Competitorn/a
Meas. Tech.ChEMBL_1474037 (CHEMBL3423895)
IC50 2.9±n/a nM
Citation Liu, YLang, YPatel, NKNg, GLaufer, RLi, SWEdwards, LForrest, BSampson, PBFeher, MBan, FAwrey, DEBeletskaya, IMao, GHodgson, RPlotnikova, OQiu, WChirgadze, NYMason, JMWei, XLin, DCChe, YKiarash, RMadeira, BFletcher, GCMak, TWBray, MRPauls, HW The Discovery of Orally Bioavailable Tyrosine Threonine Kinase (TTK) Inhibitors: 3-(4-(heterocyclyl)phenyl)-1H-indazole-5-carboxamides as Anticancer Agents. J Med Chem58:3366-92 (2015) 
 
Dual specificity protein kinase TTK
Name:Dual specificity protein kinase TTK
Type:Protein
Mol. Mass.:97086.79
Organism:Homo sapiens (Human)
Description:P33981
Residue:857
BDBM50053304
NameBDBM50053304
Synonyms:CHEMBL3330410
TypeSmall organic molecule
Emp. Form.C23H23N5O3S2
Mol. Mass.481.59
SMILESNS(=O)(=O)c1cccc(c1)-c1n[nH]c2ccc(NC(=O)C(N3CCCC3)c3ccsc3)cc12