Reaction Details
TargetDual specificity protein kinase TTK
LigandBDBM50081607
Substrate/Competitorn/a
Meas. Tech.ChEMBL_1474037 (CHEMBL3423895)
IC50 1.1±n/a nM
Citation Liu, YLang, YPatel, NKNg, GLaufer, RLi, SWEdwards, LForrest, BSampson, PBFeher, MBan, FAwrey, DEBeletskaya, IMao, GHodgson, RPlotnikova, OQiu, WChirgadze, NYMason, JMWei, XLin, DCChe, YKiarash, RMadeira, BFletcher, GCMak, TWBray, MRPauls, HW The Discovery of Orally Bioavailable Tyrosine Threonine Kinase (TTK) Inhibitors: 3-(4-(heterocyclyl)phenyl)-1H-indazole-5-carboxamides as Anticancer Agents. J Med Chem58:3366-92 (2015) 
 
Dual specificity protein kinase TTK
Name:Dual specificity protein kinase TTK
Type:Protein
Mol. Mass.:97086.79
Organism:Homo sapiens (Human)
Description:P33981
Residue:857
BDBM50081607
NameBDBM50081607
Synonyms:CHEMBL3422080
TypeSmall organic molecule
Emp. Form.C31H39N5O3
Mol. Mass.529.6731
SMILESO=C(NCC1(CCCCC1)N1CCOCC1)c1ccc2[nH]nc(-c3ccc(cc3)N3C4CCC3COC4)c2c1