Reaction Details
TargetCoagulation factor XIII A chain
LigandBDBM50009248
Substrate/Competitorn/a
Meas. Tech.ChEMBL_1475048 (CHEMBL3424619)
IC50 18000±n/a nM
Citation Avery, CAPease, RJSmith, KBoothby, MBuckley, HMGrant, PJFishwick, CW (±) cis-Bisamido epoxides: A novel series of potent FXIII-A inhibitors. Eur J Med Chem98:49-53 (2015) 
 
Coagulation factor XIII A chain
Name:Coagulation factor XIII A chain
Type:PROTEIN
Mol. Mass.:83261.29
Organism:Homo sapiens (Human)
Description:ChEMBL_1475048
Residue:732
BDBM50009248
NameBDBM50009248
Synonyms:(2R,3S)-3-((4E,7E)-Nona-4,7-dienoyl)-oxirane-2-carboxylic acid amide 3-Nona-4,7-dienoyl-oxirane-2-carboxylic acid amide CERULENIN | CHEMBL45627
TypeSmall organic molecule
Emp. Form.C12H17NO3
Mol. Mass.223.2683
SMILESC\C=C\C\C=C\CCC(=O)[C@H]1O[C@H]1C(N)=O