Reaction Details
TargetHematopoietic prostaglandin D synthase
LigandBDBM50084152
Substrate/Competitorn/a
Meas. Tech.ChEMBL_1477160 (CHEMBL3428600)
Kd 23±n/a nM
Citation Edfeldt, FEvenäs, JLepistö, MWard, APetersen, JWissler, LRohman, MSivars, USvensson, KPerry, MFeierberg, IZhou, XHHansson, TNarjes, F Identification of indole inhibitors of human hematopoietic prostaglandin D2 synthase (hH-PGDS). Bioorg Med Chem Lett25:2496-500 (2015) 
 
Hematopoietic prostaglandin D synthase
Name:Hematopoietic prostaglandin D synthase
Type:Enzyme
Mol. Mass.:23341.07
Organism:Homo sapiens (Human)
Description:The protein was expressed in E. coli strain BL21(DE3) with an N-terminal 6-His tag.
Residue:199
BDBM50084152
NameBDBM50084152
Synonyms:CHEMBL3425949
TypeSmall organic molecule
Emp. Form.C22H20N6O3
Mol. Mass.416.4326
SMILESCC(C)(O)c1nc(no1)-c1ccc(CNC(=O)c2cnc(nc2)-c2ccccn2)cc1