Reaction Details
TargetHematopoietic prostaglandin D synthase
LigandBDBM50084153
Substrate/Competitorn/a
Meas. Tech.ChEMBL_1477160 (CHEMBL3428600)
Kd 44±n/a nM
Citation Edfeldt, FEvenäs, JLepistö, MWard, APetersen, JWissler, LRohman, MSivars, USvensson, KPerry, MFeierberg, IZhou, XHHansson, TNarjes, F Identification of indole inhibitors of human hematopoietic prostaglandin D2 synthase (hH-PGDS). Bioorg Med Chem Lett25:2496-500 (2015) 
 
Hematopoietic prostaglandin D synthase
Name:Hematopoietic prostaglandin D synthase
Type:Enzyme
Mol. Mass.:23341.07
Organism:Homo sapiens (Human)
Description:The protein was expressed in E. coli strain BL21(DE3) with an N-terminal 6-His tag.
Residue:199
BDBM50084153
NameBDBM50084153
Synonyms:CHEMBL3425948
TypeSmall organic molecule
Emp. Form.C20H22F3N3O2
Mol. Mass.393.4028
SMILESCOc1cccc(c1)-c1ccc(cn1)C(=O)NC1CCN(CC(F)(F)F)CC1