Reaction Details
TargetHematopoietic prostaglandin D synthase
LigandBDBM50084262
Substrate/Competitorn/a
Meas. Tech.ChEMBL_1477160 (CHEMBL3428600)
Kd 400±n/a nM
Citation Edfeldt, FEvenäs, JLepistö, MWard, APetersen, JWissler, LRohman, MSivars, USvensson, KPerry, MFeierberg, IZhou, XHHansson, TNarjes, F Identification of indole inhibitors of human hematopoietic prostaglandin D2 synthase (hH-PGDS). Bioorg Med Chem Lett25:2496-500 (2015) 
 
Hematopoietic prostaglandin D synthase
Name:Hematopoietic prostaglandin D synthase
Type:Enzyme
Mol. Mass.:23341.07
Organism:Homo sapiens (Human)
Description:The protein was expressed in E. coli strain BL21(DE3) with an N-terminal 6-His tag.
Residue:199
BDBM50084262
NameBDBM50084262
Synonyms:CHEMBL3425963
TypeSmall organic molecule
Emp. Form.C17H23F3N4O2
Mol. Mass.372.3853
SMILESFC(F)(F)CN1CCC(CC1)NC(=O)c1ccc(nc1)N1CCOCC1