Reaction Details
TargetHematopoietic prostaglandin D synthase
LigandBDBM50084269
Substrate/Competitorn/a
Meas. Tech.ChEMBL_1477161 (CHEMBL3428601)
Kd 800±n/a nM
Citation Edfeldt, FEvenäs, JLepistö, MWard, APetersen, JWissler, LRohman, MSivars, USvensson, KPerry, MFeierberg, IZhou, XHHansson, TNarjes, F Identification of indole inhibitors of human hematopoietic prostaglandin D2 synthase (hH-PGDS). Bioorg Med Chem Lett25:2496-500 (2015) 
 
Hematopoietic prostaglandin D synthase
Name:Hematopoietic prostaglandin D synthase
Type:Enzyme
Mol. Mass.:23341.07
Organism:Homo sapiens (Human)
Description:The protein was expressed in E. coli strain BL21(DE3) with an N-terminal 6-His tag.
Residue:199
BDBM50084269
NameBDBM50084269
Synonyms:CHEMBL3425970
TypeSmall organic molecule
Emp. Form.C12H9FN2O
Mol. Mass.216.2111
SMILESNC(=O)c1ccc(nc1)-c1cccc(F)c1