Reaction Details
TargetHematopoietic prostaglandin D synthase
LigandBDBM50084257
Substrate/Competitorn/a
Meas. Tech.ChEMBL_1477164 (CHEMBL3428604)
IC50 1200±n/a nM
Citation Edfeldt, FEvenäs, JLepistö, MWard, APetersen, JWissler, LRohman, MSivars, USvensson, KPerry, MFeierberg, IZhou, XHHansson, TNarjes, F Identification of indole inhibitors of human hematopoietic prostaglandin D2 synthase (hH-PGDS). Bioorg Med Chem Lett25:2496-500 (2015) 
 
Hematopoietic prostaglandin D synthase
Name:Hematopoietic prostaglandin D synthase
Type:Enzyme
Mol. Mass.:23341.07
Organism:Homo sapiens (Human)
Description:The protein was expressed in E. coli strain BL21(DE3) with an N-terminal 6-His tag.
Residue:199
BDBM50084257
NameBDBM50084257
Synonyms:CHEMBL3425958
TypeSmall organic molecule
Emp. Form.C19H17N5O
Mol. Mass.331.3712
SMILESCn1cncc1CC(=O)Nc1cncc(c1)-c1cccc2[nH]ccc12