Reaction Details
TargetSimilar to alpha-tubulin isoform 1
LigandBDBM50084938
Substrate/Competitorn/a
Meas. Tech.ChEMBL_1476789 (CHEMBL3429443)
IC50 1100±n/a nM
Citation Romagnoli, RBaraldi, PGSalvador, MKPrencipe, FLopez-Cara, CSchiaffino Ortega, SBrancale, AHamel, ECastagliuolo, IMitola, SRonca, RBortolozzi, RPorcù, EBasso, GViola, G Design, synthesis, in vitro, and in vivo anticancer and antiangiogenic activity of novel 3-arylaminobenzofuran derivatives targeting the colchicine site on tubulin. J Med Chem58:3209-22 (2015) 
 
Similar to alpha-tubulin isoform 1
Name:Similar to alpha-tubulin isoform 1
Synonyms:Similar to alpha-tubulin isoform 1
Type:PROTEIN
Mol. Mass.:10383.05
Organism:Bos taurus
Description:ChEMBL_104716
Residue:99
BDBM50084938
NameBDBM50084938
Synonyms:CHEMBL3427378
TypeSmall organic molecule
Emp. Form.C20H21NO7
Mol. Mass.387.3832
SMILESCOC(=O)c1oc2cc(OC)ccc2c1Nc1cc(OC)c(OC)c(OC)c1