Reaction Details
TargetUbiquitin-like domain-containing CTD phosphatase 1
LigandBDBM50087856
Substrate/Competitorn/a
Meas. Tech.ChEMBL_1476203 (CHEMBL3429253)
Ki 1000±n/a nM
Citation He, YGuo, XYu, ZHWu, LGunawan, AMZhang, YDixon, JEZhang, ZY A potent and selective inhibitor for the UBLCP1 proteasome phosphatase. Bioorg Med Chem23:2798-809 (2015) 
 
Ubiquitin-like domain-containing CTD phosphatase 1
Name:Ubiquitin-like domain-containing CTD phosphatase 1
Type:Enzyme
Mol. Mass.:36803.71
Organism:Homo sapiens (Human)
Description:Q8WVY7
Residue:318
BDBM50087856
NameBDBM50087856
Synonyms:CHEMBL3426913
TypeSmall organic molecule
Emp. Form.C28H30F3NO6
Mol. Mass.533.5361
SMILESCCCCC(Oc1cc(O)c(cc1C#Cc1ccccc1OC(F)(F)F)C(O)=O)C(=O)NC1CCCCC1