Reaction Details
TargetSerine/threonine-protein phosphatase 5
LigandBDBM50087856
Substrate/Competitorn/a
Meas. Tech.ChEMBL_1476076 (CHEMBL3428706)
pH7±n/a
IC50>50000±n/a nM
Commentsextracted
Citation He, YGuo, XYu, ZHWu, LGunawan, AMZhang, YDixon, JEZhang, ZY A potent and selective inhibitor for the UBLCP1 proteasome phosphatase. Bioorg Med Chem23:2798-809 (2015) 
 
Serine/threonine-protein phosphatase 5
Name:Serine/threonine-protein phosphatase 5
Type:Enzyme
Mol. Mass.:56875.49
Organism:Homo sapiens (Human)
Description:P53041
Residue:499
BDBM50087856
NameBDBM50087856
Synonyms:CHEMBL3426913
TypeSmall organic molecule
Emp. Form.C28H30F3NO6
Mol. Mass.533.5361
SMILESCCCCC(Oc1cc(O)c(cc1C#Cc1ccccc1OC(F)(F)F)C(O)=O)C(=O)NC1CCCCC1