Reaction Details
TargetReceptor-type tyrosine-protein phosphatase gamma
LigandBDBM50087856
Substrate/Competitorn/a
Meas. Tech.ChEMBL_1476075 (CHEMBL3428705)
pH7±n/a
IC50>50000±n/a nM
Commentsextracted
Citation He, YGuo, XYu, ZHWu, LGunawan, AMZhang, YDixon, JEZhang, ZY A potent and selective inhibitor for the UBLCP1 proteasome phosphatase. Bioorg Med Chem23:2798-809 (2015) 
 
Receptor-type tyrosine-protein phosphatase gamma
Name:Receptor-type tyrosine-protein phosphatase gamma
Type:Protein
Mol. Mass.:161998.07
Organism:Homo sapiens (Human)
Description:P23470
Residue:1445
BDBM50087856
NameBDBM50087856
Synonyms:CHEMBL3426913
TypeSmall organic molecule
Emp. Form.C28H30F3NO6
Mol. Mass.533.5361
SMILESCCCCC(Oc1cc(O)c(cc1C#Cc1ccccc1OC(F)(F)F)C(O)=O)C(=O)NC1CCCCC1