Reaction Details
TargetDual specificity protein phosphatase 10
LigandBDBM50087856
Substrate/Competitorn/a
Meas. Tech.ChEMBL_1476069 (CHEMBL3428699)
pH7±n/a
IC50 5700±n/a nM
Commentsextracted
Citation He, YGuo, XYu, ZHWu, LGunawan, AMZhang, YDixon, JEZhang, ZY A potent and selective inhibitor for the UBLCP1 proteasome phosphatase. Bioorg Med Chem23:2798-809 (2015) 
 
Dual specificity protein phosphatase 10
Name:Dual specificity protein phosphatase 10
Type:Enzyme
Mol. Mass.:52649.12
Organism:Homo sapiens (Human)
Description:Q9Y6W6
Residue:482
BDBM50087856
NameBDBM50087856
Synonyms:CHEMBL3426913
TypeSmall organic molecule
Emp. Form.C28H30F3NO6
Mol. Mass.533.5361
SMILESCCCCC(Oc1cc(O)c(cc1C#Cc1ccccc1OC(F)(F)F)C(O)=O)C(=O)NC1CCCCC1