Reaction Details
TargetTyrosine-protein phosphatase non-receptor type 2
LigandBDBM50087856
Substrate/Competitorn/a
Meas. Tech.ChEMBL_1476066 (CHEMBL3428562)
pH7±n/a
IC50 10100±n/a nM
Commentsextracted
Citation He, YGuo, XYu, ZHWu, LGunawan, AMZhang, YDixon, JEZhang, ZY A potent and selective inhibitor for the UBLCP1 proteasome phosphatase. Bioorg Med Chem23:2798-809 (2015) 
 
Tyrosine-protein phosphatase non-receptor type 2
Name:Tyrosine-protein phosphatase non-receptor type 2
Type:Protein
Mol. Mass.:48481.80
Organism:Homo sapiens (Human)
Description:P17706
Residue:415
BDBM50087856
NameBDBM50087856
Synonyms:CHEMBL3426913
TypeSmall organic molecule
Emp. Form.C28H30F3NO6
Mol. Mass.533.5361
SMILESCCCCC(Oc1cc(O)c(cc1C#Cc1ccccc1OC(F)(F)F)C(O)=O)C(=O)NC1CCCCC1