Reaction Details
TargetTyrosine-protein phosphatase non-receptor type 14
LigandBDBM50087856
Substrate/Competitorn/a
Meas. Tech.ChEMBL_1476061 (CHEMBL3428557)
pH7±n/a
IC50 8300±n/a nM
Commentsextracted
Citation He, YGuo, XYu, ZHWu, LGunawan, AMZhang, YDixon, JEZhang, ZY A potent and selective inhibitor for the UBLCP1 proteasome phosphatase. Bioorg Med Chem23:2798-809 (2015) 
 
Tyrosine-protein phosphatase non-receptor type 14
Name:Tyrosine-protein phosphatase non-receptor type 14
Type:Enzyme
Mol. Mass.:135291.73
Organism:Homo sapiens (Human)
Description:Q15678
Residue:1187
BDBM50087856
NameBDBM50087856
Synonyms:CHEMBL3426913
TypeSmall organic molecule
Emp. Form.C28H30F3NO6
Mol. Mass.533.5361
SMILESCCCCC(Oc1cc(O)c(cc1C#Cc1ccccc1OC(F)(F)F)C(O)=O)C(=O)NC1CCCCC1