Reaction Details
TargetTyrosine-protein phosphatase non-receptor type 3
LigandBDBM50087856
Substrate/Competitorn/a
Meas. Tech.ChEMBL_1476060 (CHEMBL3428556)
pH7±n/a
IC50 13900±n/a nM
Commentsextracted
Citation He, YGuo, XYu, ZHWu, LGunawan, AMZhang, YDixon, JEZhang, ZY A potent and selective inhibitor for the UBLCP1 proteasome phosphatase. Bioorg Med Chem23:2798-809 (2015) 
 
Tyrosine-protein phosphatase non-receptor type 3
Name:Tyrosine-protein phosphatase non-receptor type 3
Type:Protein
Mol. Mass.:103998.76
Organism:Homo sapiens (Human)
Description:P26045
Residue:913
BDBM50087856
NameBDBM50087856
Synonyms:CHEMBL3426913
TypeSmall organic molecule
Emp. Form.C28H30F3NO6
Mol. Mass.533.5361
SMILESCCCCC(Oc1cc(O)c(cc1C#Cc1ccccc1OC(F)(F)F)C(O)=O)C(=O)NC1CCCCC1