Reaction Details
TargetTransient receptor potential cation channel subfamily V member 1
LigandBDBM50088036
Substrate/Competitorn/a
Meas. Tech.ChEMBL_1476521 (CHEMBL3428072)
Ki 1.3±n/a nM
Citation Tran, PTKim, HSAnn, JKim, SEKim, CHong, MHoang, VHNgo, VTHong, SCui, MChoi, SBlumberg, PMFrank-Foltyn, RBahrenberg, GStockhausen, HChristoph, TLee, J a-Substituted 2-(3-fluoro-4-methylsulfonamidophenyl)acetamides as potent TRPV1 antagonists. Bioorg Med Chem Lett25:2326-30 (2015) 
 
Transient receptor potential cation channel subfamily V member 1
Name:Transient receptor potential cation channel subfamily V member 1
Type:Protein
Mol. Mass.:94960.75
Organism:Homo sapiens (Human)
Description:Q8NER1
Residue:839
BDBM50088036
NameBDBM50088036
Synonyms:CHEMBL3427101
TypeSmall organic molecule
Emp. Form.C28H30F4N4O3S
Mol. Mass.578.621
SMILESCC1CCN(CC1)c1nc(ccc1CNC(=O)C(c1ccccc1)c1ccc(NS(C)(=O)=O)c(F)c1)C(F)(F)F