Reaction Details
TargetTransient receptor potential cation channel subfamily V member 1
LigandBDBM50049553
Substrate/Competitorn/a
Meas. Tech.ChEMBL_1476521 (CHEMBL3428072)
Ki 0.300000±n/a nM
Citation Tran, PTKim, HSAnn, JKim, SEKim, CHong, MHoang, VHNgo, VTHong, SCui, MChoi, SBlumberg, PMFrank-Foltyn, RBahrenberg, GStockhausen, HChristoph, TLee, J a-Substituted 2-(3-fluoro-4-methylsulfonamidophenyl)acetamides as potent TRPV1 antagonists. Bioorg Med Chem Lett25:2326-30 (2015) 
 
Transient receptor potential cation channel subfamily V member 1
Name:Transient receptor potential cation channel subfamily V member 1
Type:Protein
Mol. Mass.:94960.75
Organism:Homo sapiens (Human)
Description:Q8NER1
Residue:839
BDBM50049553
NameBDBM50049553
Synonyms:CHEMBL2177428
TypeSmall organic molecule
Emp. Form.C23H28F4N4O3S
Mol. Mass.516.552
SMILESCC(C(=O)NCc1ccc(nc1N1CCC(C)CC1)C(F)(F)F)c1ccc(NS(C)(=O)=O)c(F)c1