Reaction Details
TargetEquilibrative nucleoside transporter 1
LigandBDBM50088517
Substrate/Competitorn/a
Meas. Tech.ChEMBL_1494513 (CHEMBL3528990)
Ki 51000±n/a nM
Citation Lepist, EIDamaraju, VLZhang, JGati, WPYao, SYSmith, KMKarpinski, EYoung, JDLeung, KHCass, CE Transport of A1 adenosine receptor agonist tecadenoson by human and mouse nucleoside transporters: evidence for blood-brain barrier transport by murine equilibrative nucleoside transporter 1 mENT1. Drug Metab Dispos41:916-22 (2013) 
 
Equilibrative nucleoside transporter 1
Name:Equilibrative nucleoside transporter 1
Type:Multi-pass membrane protein
Mol. Mass.:50225.92
Organism:Homo sapiens (Human)
Description:n/a
Residue:456
BDBM50088517
NameBDBM50088517
Synonyms:CHEBI:16704 | Uridine
TypeSmall organic molecule
Emp. Form.C9H12N2O6
Mol. Mass.244.2014
SMILESOC[C@H]1O[C@H]([C@H](O)[C@@H]1O)n1ccc(=O)[nH]c1=O