Reaction Details
TargetMitogen-activated protein kinase 3
LigandBDBM50088894
Substrate/Competitorn/a
Meas. Tech.ChEMBL_1497089 (CHEMBL3580222)
IC50 43±n/a nM
Citation Awadallah, FMAbou-Seri, SMAbdulla, MMGeorgey, HH Design and synthesis of potent 1,2,4-trisubstituted imidazolinone derivatives with dual p38aMAPK and ERK1/2 inhibitory activity. Eur J Med Chem94:397-404 (2015) 
 
Mitogen-activated protein kinase 3
Name:Mitogen-activated protein kinase 3
Type:Protein
Mol. Mass.:43136.58
Organism:Homo sapiens (Human)
Description:curated by PDB 4QTB
Residue:379
BDBM50088894
NameBDBM50088894
Synonyms:CHEMBL3577564
TypeSmall organic molecule
Emp. Form.C32H27N3O4
Mol. Mass.517.5745
SMILESCOc1cccc(c1)N1C(=O)\C(=C\c2ccc(OCC(=O)Nc3ccccc3C)cc2)N=C1c1ccccc1