Reaction Details
TargetMitogen-activated protein kinase 14
LigandBDBM50088855
Substrate/Competitorn/a
Meas. Tech.ChEMBL_1497088 (CHEMBL3580221)
IC50 4.3±n/a nM
Citation Awadallah, FMAbou-Seri, SMAbdulla, MMGeorgey, HH Design and synthesis of potent 1,2,4-trisubstituted imidazolinone derivatives with dual p38aMAPK and ERK1/2 inhibitory activity. Eur J Med Chem94:397-404 (2015) 
 
Mitogen-activated protein kinase 14
Name:Mitogen-activated protein kinase 14
Type:Serine/threonine-protein kinase
Mol. Mass.:41286.76
Organism:Homo sapiens (Human)
Description:Q16539
Residue:360
BDBM50088855
NameBDBM50088855
Synonyms:CHEMBL3577632
TypeSmall organic molecule
Emp. Form.C32H27N3O5
Mol. Mass.533.5739
SMILESCOc1ccc(NC(=O)COc2ccc(\C=C3/N=C(N(C3=O)c3cccc(OC)c3)c3ccccc3)cc2)cc1