Reaction Details
TargetMitogen-activated protein kinase 1
LigandBDBM50088897
Substrate/Competitorn/a
Meas. Tech.ChEMBL_1497090 (CHEMBL3580223)
IC50 7.0±n/a nM
Citation Awadallah, FMAbou-Seri, SMAbdulla, MMGeorgey, HH Design and synthesis of potent 1,2,4-trisubstituted imidazolinone derivatives with dual p38aMAPK and ERK1/2 inhibitory activity. Eur J Med Chem94:397-404 (2015) 
 
Mitogen-activated protein kinase 1
Name:Mitogen-activated protein kinase 1
Type:Ser/Thr Protein Kinase
Mol. Mass.:41392.76
Organism:Homo sapiens (Human)
Description:P28482
Residue:360
BDBM50088897
NameBDBM50088897
Synonyms:CHEMBL3577644
TypeSmall organic molecule
Emp. Form.C31H24ClN3O4
Mol. Mass.537.993
SMILESCOc1ccc(cc1)N1C(=O)\C(=C\c2ccc(OCC(=O)Nc3cccc(Cl)c3)cc2)N=C1c1ccccc1