Reaction Details
TargetMitogen-activated protein kinase 10
LigandBDBM50089230
Substrate/Competitorn/a
Meas. Tech.ChEMBL_1496169 (CHEMBL3578950)
IC50 37±n/a nM
Citation Zheng, KPark, CMIqbal, SHernandez, PPark, HLoGrasso, PVFeng, Y Pyridopyrimidinone Derivatives as Potent and Selective c-Jun N-Terminal Kinase (JNK) Inhibitors. ACS Med Chem Lett6:413-8 (2015) 
 
Mitogen-activated protein kinase 10
Name:Mitogen-activated protein kinase 10
Type:Enzyme
Mol. Mass.:52586.89
Organism:Homo sapiens (Human)
Description:n/a
Residue:464
BDBM50089230
NameBDBM50089230
Synonyms:CHEMBL3577871
TypeSmall organic molecule
Emp. Form.C19H28N6O2
Mol. Mass.372.4646
SMILESCCNC(=O)N[C@H]1CC[C@H](CC1)Nc1ncc2ccc(=O)n(C(C)C)c2n1