Reaction Details
TargetTyrosine-protein kinase Fyn
LigandBDBM50089581
Substrate/Competitorn/a
Meas. Tech.ChEMBL_1497041 (CHEMBL3580016)
Ki 1150±n/a nM
Citation Tintori, CLa Sala, GVignaroli, GBotta, LFallacara, ALFalchi, FRadi, MZamperini, CDreassi, EDello Iacono, LOrioli, DBiamonti, GGarbelli, MLossani, AGasparrini, FTuccinardi, TLaurenzana, IAngelucci, AMaga, GSchenone, SBrullo, CMusumeci, FDesogus, ACrespan, EBotta, M Studies on the ATP Binding Site of Fyn Kinase for the Identification of New Inhibitors and Their Evaluation as Potential Agents against Tauopathies and Tumors. J Med Chem58:4590-609 (2015) 
 
Tyrosine-protein kinase Fyn
Name:Tyrosine-protein kinase Fyn
Type:Enzyme
Mol. Mass.:60762.21
Organism:Homo sapiens (Human)
Description:P06241
Residue:537
BDBM50089581
NameBDBM50089581
Synonyms:CHEMBL3578210
TypeSmall organic molecule
Emp. Form.C22H22N6O
Mol. Mass.386.4497
SMILESOCCNc1nc(NCc2ccccc2)c2cnn(\C=C\c3ccccc3)c2n1