Reaction Details
TargetBeta-hexosaminidase subunit alpha
LigandBDBM50089673
Substrate/Competitorn/a
Meas. Tech.ChEMBL_1496352 (CHEMBL3579956)
IC50>400000±n/a nM
Citation Tropak, MBZhang, JYonekawa, SRigat, BAAulakh, VSSmith, MRHwang, HJCiufolini, MAMahuran, DJ Pyrimethamine Derivatives: Insight into Binding Mechanism and Improved Enhancement of Mutantß-N-acetylhexosaminidase Activity. J Med Chem58:4483-93 (2015) 
 
Beta-hexosaminidase subunit alpha
Name:Beta-hexosaminidase subunit alpha
Type:Protein
Mol. Mass.:60688.46
Organism:Homo sapiens (Human)
Description:P06865
Residue:529
BDBM50089673
NameBDBM50089673
Synonyms:CHEMBL3577314
TypeSmall organic molecule
Emp. Form.C12H12ClN3
Mol. Mass.233.697
SMILESCCc1nc(N)ncc1-c1ccc(Cl)cc1