Reaction Details
TargetProgesterone receptor
LigandBDBM50090462
Substrate/Competitorn/a
Meas. Tech.ChEMBL_1498079 (CHEMBL3582533)
IC50>1000±n/a nM
Citation Lai, AKahraman, MGovek, SNagasawa, JBonnefous, CJulien, JDouglas, KSensintaffar, JLu, NLee, KJAparicio, AKaufman, JQian, JShao, GPrudente, RMoon, MJJoseph, JDDarimont, BBrigham, DGrillot, KHeyman, RRix, PJHager, JHSmith, ND Identification of GDC-0810 (ARN-810), an Orally Bioavailable Selective Estrogen Receptor Degrader (SERD) that Demonstrates Robust Activity in Tamoxifen-Resistant Breast Cancer Xenografts. J Med Chem58:4888-904 (2015) 
 
Progesterone receptor
Name:Progesterone receptor
Type:Protein
Mol. Mass.:98979.52
Organism:Homo sapiens (Human)
Description:P06401
Residue:933
BDBM50090462
NameBDBM50090462
Synonyms:CHEMBL3581693 | US20240043442, Example GDC-0810
TypeSmall organic molecule
Emp. Form.C26H20ClFN2O2
Mol. Mass.446.901
SMILESCC\C(=C(\c1ccc(\C=C\C(O)=O)cc1)c1ccc2[nH]ncc2c1)c1ccc(F)cc1Cl