Reaction Details
TargetBeta-1,4-mannosyl-glycoprotein 4-beta-N-acetylglucosaminyltransferase
LigandBDBM50090510
Substrate/Competitorn/a
Meas. Tech.ChEMBL_1498284 (CHEMBL3583805)
IC50>30000±n/a nM
Citation Sato, KTakahagi, HYoshikawa, TMorimoto, STakai, THidaka, KKamaura, MKubo, OAdachi, RIshii, TMaki, TMochida, TTakekawa, SNakakariya, MAmano, NKitazaki, T Discovery of a Novel Series of N-Phenylindoline-5-sulfonamide Derivatives as Potent, Selective, and Orally Bioavailable Acyl CoA:Monoacylglycerol Acyltransferase-2 Inhibitors. J Med Chem58:3892-909 (2015) 
 
Beta-1,4-mannosyl-glycoprotein 4-beta-N-acetylglucosaminyltransferase
Name:Beta-1,4-mannosyl-glycoprotein 4-beta-N-acetylglucosaminyltransferase
Type:PROTEIN
Mol. Mass.:61324.81
Organism:Homo sapiens (Human)
Description:ChEMBL_107586
Residue:533
BDBM50090510
NameBDBM50090510
Synonyms:CHEMBL3581716
TypeSmall organic molecule
Emp. Form.C24H23F2N3O3S
Mol. Mass.471.52
SMILESCC(=O)Nc1cc(cc2CCN(CCc3ccccc3)c12)S(=O)(=O)Nc1ccc(F)cc1F