Reaction Details
TargetMacrophage-stimulating protein receptor
LigandBDBM50317324
Substrate/Competitorn/a
Meas. Tech.ChEMBL_1499715 (CHEMBL3585031)
IC50 16±n/a nM
Citation Raeppel, SLRaeppel, FTherrien, E Design and synthesis of close analogs of LCRF-0004, a potent and selective RON receptor tyrosine kinase inhibitor. Bioorg Med Chem Lett25:2527-31 (2015) 
 
Macrophage-stimulating protein receptor
Name:Macrophage-stimulating protein receptor
Type:Protein
Mol. Mass.:152270.76
Organism:Homo sapiens (Human)
Description:Q04912
Residue:1400
BDBM50317324
NameBDBM50317324
Synonyms:CHEMBL1087984 US8999982, Ref1
TypeSmall organic molecule
Emp. Form.C28H20F4N4O4
Mol. Mass.552.4764
SMILESCOc1cc2nccc(Oc3ccc(NC(=O)c4cnn(c4C(F)(F)F)-c4ccccc4)cc3F)c2cc1OC