Reaction Details
TargetAcetylcholinesterase
LigandBDBM50091311
Substrate/Competitorn/a
Meas. Tech.ChEMBL_1500179 (CHEMBL3584728)
IC50 160±n/a nM
Citation Gazzard, LWilliams, KChen, HAxford, LBlackwood, EBurton, BChapman, KCrackett, PDrobnick, JEllwood, CEpler, JFlagella, MGancia, EGill, MGoodacre, SHalladay, JHewitt, JHunt, HKintz, SLyssikatos, JMacleod, CMajor, SMédard, GNarukulla, RRamiscal, JSchmidt, SSeward, EWiesmann, CWu, PYee, SYen, IMalek, S Mitigation of Acetylcholine Esterase Activity in the 1,7-Diazacarbazole Series of Inhibitors of Checkpoint Kinase 1. J Med Chem58:5053-74 (2015) 
 
Acetylcholinesterase
Name:Acetylcholinesterase
Type:Enzyme
Mol. Mass.:67792.70
Organism:Homo sapiens (Human)
Description:P22303
Residue:614
BDBM50091311
NameBDBM50091311
Synonyms:CHEMBL3582215
TypeSmall organic molecule
Emp. Form.C22H19N5
Mol. Mass.353.4198
SMILESCCN1CCc2cc(ccc2C1)-c1cnc2[nH]c3cnc(cc3c2c1)C#N