Reaction Details
TargetSerine/threonine-protein kinase Chk1
LigandBDBM50091317
Substrate/Competitorn/a
Meas. Tech.ChEMBL_1500168 (CHEMBL3584717)
IC50 12±n/a nM
Citation Gazzard, LWilliams, KChen, HAxford, LBlackwood, EBurton, BChapman, KCrackett, PDrobnick, JEllwood, CEpler, JFlagella, MGancia, EGill, MGoodacre, SHalladay, JHewitt, JHunt, HKintz, SLyssikatos, JMacleod, CMajor, SMédard, GNarukulla, RRamiscal, JSchmidt, SSeward, EWiesmann, CWu, PYee, SYen, IMalek, S Mitigation of Acetylcholine Esterase Activity in the 1,7-Diazacarbazole Series of Inhibitors of Checkpoint Kinase 1. J Med Chem58:5053-74 (2015) 
 
Serine/threonine-protein kinase Chk1
Name:Serine/threonine-protein kinase Chk1
Type:Enzyme Catalytic Domain
Mol. Mass.:54443.02
Organism:Homo sapiens (Human)
Description:gi_166295192
Residue:476
BDBM50091317
NameBDBM50091317
Synonyms:CHEMBL3582210
TypeSmall organic molecule
Emp. Form.C24H20N6
Mol. Mass.392.4558
SMILESN#CC1CCN(Cc2ccc(cc2)-c2cnc3[nH]c4cnc(cc4c3c2)C#N)CC1