Reaction Details
TargetSerine/threonine-protein kinase B-raf
LigandBDBM50091765
Substrate/Competitorn/a
Meas. Tech.ChEMBL_1498391 (CHEMBL3584220)
IC50 3.0±n/a nM
Citation Li, YCheng, HZhang, ZZhuang, XLuo, JLong, HZhou, YXu, YTaghipouran, RLi, DPatterson, ASmaill, JTu, ZWu, DRen, XDing, K N-(3-Ethynyl-2,4-difluorophenyl)sulfonamide Derivatives as Selective Raf Inhibitors. ACS Med Chem Lett6:543-7 (2015) 
 
Serine/threonine-protein kinase B-raf
Name:Serine/threonine-protein kinase B-raf
Type:Serine/threonine-protein kinase
Mol. Mass.:84446.00
Organism:Homo sapiens (Human)
Description:P15056
Residue:766
BDBM50091765
NameBDBM50091765
Synonyms:CHEMBL3582396
TypeSmall organic molecule
Emp. Form.C24H14F2N6O2S
Mol. Mass.488.469
SMILESFc1ccc(NS(=O)(=O)c2cccnc2)c(F)c1C#Cc1cnc2[nH]nc(-c3ccncc3)c2c1