Reaction Details
TargetSerine/threonine-protein kinase B-raf
LigandBDBM50091796
Substrate/Competitorn/a
Meas. Tech.ChEMBL_1498391 (CHEMBL3584220)
IC50 16±n/a nM
Citation Li, YCheng, HZhang, ZZhuang, XLuo, JLong, HZhou, YXu, YTaghipouran, RLi, DPatterson, ASmaill, JTu, ZWu, DRen, XDing, K N-(3-Ethynyl-2,4-difluorophenyl)sulfonamide Derivatives as Selective Raf Inhibitors. ACS Med Chem Lett6:543-7 (2015) 
 
Serine/threonine-protein kinase B-raf
Name:Serine/threonine-protein kinase B-raf
Type:Serine/threonine-protein kinase
Mol. Mass.:84446.00
Organism:Homo sapiens (Human)
Description:P15056
Residue:766
BDBM50091796
NameBDBM50091796
Synonyms:CHEMBL3582395
TypeSmall organic molecule
Emp. Form.C25H15F2N5O2S
Mol. Mass.487.481
SMILESFc1ccc(NS(=O)(=O)c2cccnc2)c(F)c1C#Cc1cnc2[nH]nc(-c3ccccc3)c2c1