Reaction Details
TargetMu-type opioid receptor
LigandBDBM50096745
Substrate/Competitorn/a
Meas. Tech.ChEMBL_1499012 (CHEMBL3584507)
EC50 2.5±n/a nM
Citation Piekielna, JPerlikowska, Rdo-Rego, JCdo-Rego, JLCerlesi, MCCalo, GKluczyk, ALapinski, KTömböly, CJanecka, A Synthesis of mixed opioid affinity cyclic endomorphin-2 analogues with fluorinated phenylalanines. ACS Med Chem Lett6:579-83 (2015) 
 
Mu-type opioid receptor
Name:Mu-type opioid receptor
Type:G Protein-Coupled Receptor (GPCR)
Mol. Mass.:44789.51
Organism:Homo sapiens (Human)
Description:P35372
Residue:400
BDBM50096745
NameBDBM50096745
Synonyms:CHEMBL3580745
TypeSmall organic molecule
Emp. Form.C39H48FN7O7
Mol. Mass.745.8395
SMILESCc1cc(O)cc(C)c1C[C@H](N)C(=O)N[C@@H]1CCCCNC(=O)C[C@H](NC(=O)[C@H](Cc2ccccc2)NC(=O)[C@H](Cc2ccc(F)cc2)NC1=O)C(N)=O