Reaction Details
TargetMu-type opioid receptor
LigandBDBM50096785
Substrate/Competitorn/a
Meas. Tech.ChEMBL_1499012 (CHEMBL3584507)
EC50 214±n/a nM
Citation Piekielna, JPerlikowska, Rdo-Rego, JCdo-Rego, JLCerlesi, MCCalo, GKluczyk, ALapinski, KTömböly, CJanecka, A Synthesis of mixed opioid affinity cyclic endomorphin-2 analogues with fluorinated phenylalanines. ACS Med Chem Lett6:579-83 (2015) 
 
Mu-type opioid receptor
Name:Mu-type opioid receptor
Type:G Protein-Coupled Receptor (GPCR)
Mol. Mass.:44789.51
Organism:Homo sapiens (Human)
Description:P35372
Residue:400
BDBM50096785
NameBDBM50096785
Synonyms:DYNORPHIN A (1-17) | Dynorphin A
TypeSmall organic molecule
Emp. Form.C99H155N31O23
Mol. Mass.2147.4839
SMILESCC[C@H](C)[C@H](NC(=O)[C@H](CCCNC(N)=N)NC(=O)[C@H](CCCNC(N)=N)NC(=O)[C@H](CC(C)C)NC(=O)[C@H](Cc1ccccc1)NC(=O)CNC(=O)CNC(=O)[C@@H](N)Cc1ccc(O)cc1)C(=O)N[C@@H](CCCNC(N)=N)C(=O)N1CCC[C@H]1C(=O)N[C@@H](CCCCN)C(=O)N[C@@H](CC(C)C)C(=O)N[C@@H](CCCCN)C(=O)N[C@@H](Cc1c[nH]c2ccccc12)C(=O)N[C@@H](CC(O)=O)C(=O)N[C@@H](CC(N)=O)C(=O)N[C@@H](CCC(N)=O)C(O)=O