Reaction Details
TargetMu-type opioid receptor
LigandBDBM50092199
Substrate/Competitorn/a
Meas. Tech.ChEMBL_1499012 (CHEMBL3584507)
EC50 3.2±n/a nM
Citation Piekielna, JPerlikowska, Rdo-Rego, JCdo-Rego, JLCerlesi, MCCalo, GKluczyk, ALapinski, KTömböly, CJanecka, A Synthesis of mixed opioid affinity cyclic endomorphin-2 analogues with fluorinated phenylalanines. ACS Med Chem Lett6:579-83 (2015) 
 
Mu-type opioid receptor
Name:Mu-type opioid receptor
Type:G Protein-Coupled Receptor (GPCR)
Mol. Mass.:44789.51
Organism:Homo sapiens (Human)
Description:P35372
Residue:400
BDBM50092199
NameBDBM50092199
Synonyms:CHEMBL3582487
TypeSmall organic molecule
Emp. Form.C37H44FN7O7
Mol. Mass.717.7864
SMILESN[C@@H](Cc1ccc(O)cc1)C(=O)N[C@@H]1CCCCNC(=O)C[C@H](NC(=O)[C@H](Cc2ccc(F)cc2)NC(=O)[C@H](Cc2ccccc2)NC1=O)C(N)=O