Reaction Details
TargetKappa-type opioid receptor
LigandBDBM50096790
Substrate/Competitorn/a
Meas. Tech.ChEMBL_1499018 (CHEMBL3584513)
EC50 72±n/a nM
Citation Piekielna, JPerlikowska, Rdo-Rego, JCdo-Rego, JLCerlesi, MCCalo, GKluczyk, ALapinski, KTömböly, CJanecka, A Synthesis of mixed opioid affinity cyclic endomorphin-2 analogues with fluorinated phenylalanines. ACS Med Chem Lett6:579-83 (2015) 
 
Kappa-type opioid receptor
Name:Kappa-type opioid receptor
Type:G Protein-Coupled Receptor (GPCR)
Mol. Mass.:42648.76
Organism:Homo sapiens (Human)
Description:P41145
Residue:380
BDBM50096790
NameBDBM50096790
Synonyms:CHEMBL3582486
TypeSmall organic molecule
Emp. Form.C38H44F3N7O7
Mol. Mass.767.7939
SMILESN[C@@H](Cc1ccc(O)cc1)C(=O)N[C@@H]1CCCCNC(=O)C[C@H](NC(=O)[C@H](Cc2ccccc2)NC(=O)[C@H](Cc2ccc(cc2)C(F)(F)F)NC1=O)C(N)=O