Reaction Details
TargetAtypical chemokine receptor 3
LigandBDBM50092218
Substrate/Competitorn/a
Meas. Tech.ChEMBL_1499908 (CHEMBL3583502)
IC50 1500±n/a nM
Citation Oishi, SKuroyanagi, TKubo, TMontpas, NYoshikawa, YMisu, RKobayashi, YOhno, HHeveker, NFuruya, TFujii, N Development of novel CXC chemokine receptor 7 (CXCR7) ligands: selectivity switch from CXCR4 antagonists with a cyclic pentapeptide scaffold. J Med Chem58:5218-25 (2015) 
 
Atypical chemokine receptor 3
Name:Atypical chemokine receptor 3
Type:Enzyme
Mol. Mass.:41498.84
Organism:Homo sapiens (Human)
Description:P25106
Residue:362
BDBM50092218
NameBDBM50092218
Synonyms:CHEMBL3581264
TypeSmall organic molecule
Emp. Form.C39H51N11O6
Mol. Mass.769.8923
SMILES[H][C@@]12CCCN1C(=O)[C@H](Cc1ccc3ccccc3c1)NC(=O)[C@H](CCCNC(N)=N)NC(=O)[C@H](CCCNC(N)=N)NC(=O)[C@@H](Cc1ccc(O)cc1)NC2=O