Reaction Details
TargetCannabinoid receptor 2
LigandBDBM50092347
Substrate/Competitorn/a
Meas. Tech.ChEMBL_1500631 (CHEMBL3587761)
Ki 30±n/a nM
Citation Radwan, MMElSohly, MAEl-Alfy, ATAhmed, SASlade, DHusni, ASManly, SPWilson, LSeale, SCutler, SJRoss, SA Isolation and Pharmacological Evaluation of Minor Cannabinoids from High-Potency Cannabis sativa. J Nat Prod78:1271-6 (2015) 
 
Cannabinoid receptor 2
Name:Cannabinoid receptor 2
Type:G Protein-Coupled Receptor (GPCR)
Mol. Mass.:39690.94
Organism:Homo sapiens (Human)
Description:P34972
Residue:360
BDBM50092347
NameBDBM50092347
Synonyms:CHEMBL3586106
TypeSmall organic molecule
Emp. Form.C21H30O3
Mol. Mass.330.4611
SMILES[H][C@@]12CC=C(C)[C@H](O)[C@@]1([H])c1c(O)cc(CCCCC)cc1OC2(C)C