Reaction Details
TargetCannabinoid receptor 1
LigandBDBM50092348
Substrate/Competitorn/a
Meas. Tech.ChEMBL_1500630 (CHEMBL3587760)
Ki 1906±n/a nM
Citation Radwan, MMElSohly, MAEl-Alfy, ATAhmed, SASlade, DHusni, ASManly, SPWilson, LSeale, SCutler, SJRoss, SA Isolation and Pharmacological Evaluation of Minor Cannabinoids from High-Potency Cannabis sativa. J Nat Prod78:1271-6 (2015) 
 
Cannabinoid receptor 1
Name:Cannabinoid receptor 1
Type:G Protein-Coupled Receptor (GPCR)
Mol. Mass.:52868.96
Organism:Homo sapiens (Human)
Description:P21554
Residue:472
BDBM50092348
NameBDBM50092348
Synonyms:CHEMBL3586104
TypeSmall organic molecule
Emp. Form.C21H30O3
Mol. Mass.330.4611
SMILES[H][C@@]12C=C(C)[C@@H](O)C[C@@]1([H])C(C)(C)Oc1cc(CCCCC)cc(O)c21