Reaction Details
TargetVascular endothelial growth factor receptor 2
LigandBDBM50093351
Substrate/Competitorn/a
Meas. Tech.ChEMBL_1500405 (CHEMBL3587038)
Ki>4000±n/a nM
Citation Collier, PNMessersmith, DLe Tiran, ABandarage, UKBoucher, CCome, JCottrell, KMDamagnez, VDoran, JDGriffith, JPKhare-Pandit, SKrueger, EBLedeboer, MWLedford, BLiao, YMahajan, SMoody, CSRoday, SWang, TXu, JAronov, AM Discovery of Highly Isoform Selective Thiazolopiperidine Inhibitors of Phosphoinositide 3-Kinase¿. J Med Chem58:5684-8 (2015) 
 
Vascular endothelial growth factor receptor 2
Name:Vascular endothelial growth factor receptor 2
Type:Receptor Tyrosine Kinase
Mol. Mass.:151510.97
Organism:Homo sapiens (Human)
Description:P35968
Residue:1356
BDBM50093351
NameBDBM50093351
Synonyms:CHEMBL3585362
TypeSmall organic molecule
Emp. Form.C20H22ClF2N7O2S
Mol. Mass.497.949
SMILESCOc1cc(cnc1Cl)N1CCc2nc(NC(=O)NCCc3cn(CC(F)F)cn3)sc2C1